"Untitled Post" - Views: 144 · Hits: 144 - Type: Unlisted

CommandInvokationFailure: Gradle build failed. 
C:/Program Files/Java/jdk1.8.0_121\bin\java.exe -classpath "C:\Program Files\Unity\Editor\Data\PlaybackEngines\AndroidPlayer\Tools\gradle\lib\gradle-launcher-4.0.1.jar" org.gradle.launcher.GradleMain "-Dorg.gradle.jvmargs=-Xmx2048m" "assembleDebug"

stderr[
D:\Projekte\Unity3D\Chromecast-Draw-Game\Temp\gradleOut\appcompat\build\intermediates\bundles\default\res\values-hdpi-v4\values-hdpi-v4.xml:3: AAPT: Error retrieving parent for item: No resource found that matches the given name 'Base.Widget.AppCompat.DrawerArrowToggle.Common'.
    
D:\Projekte\Unity3D\Chromecast-Draw-Game\Temp\gradleOut\appcompat\build\intermediates\bundles\default\res\values-hdpi-v4\values-hdpi-v4.xml:4:23-30: AAPT: No resource found that matches the given name: attr 'barSize'.
    
D:\Projekte\Unity3D\Chromecast-Draw-Game\Temp\gradleOut\appcompat\build\intermediates\bundles\default\res\values-hdpi-v4\values-hdpi-v4.xml:6:23-35: AAPT: No resource found that matches the given name: attr 'drawableSize'.
    
D:\Projekte\Unity3D\Chromecast-Draw-Game\Temp\gradleOut\appcompat\build\intermediates\bundles\default\res\values-hdpi-v4\values-hdpi-v4.xml:5:23-37: AAPT: No resource found that matches the given name: attr 'gapBetweenBars'.
    
D:\Projekte\Unity3D\Chromecast-Draw-Game\Temp\gradleOut\appcompat\build\intermediates\bundles\default\res\values-v12\values-v12.xml:3: AAPT: Error retrieving parent for item: No resource found that matches the given name 'Base.V7.Widget.AppCompat.AutoCompleteTextView'.
    
D:\Projekte\Unity3D\Chromecast-Draw-Game\Temp\gradleOut\appcompat\build\intermediates\bundles\default\res\values-v12\values-v12.xml:6: AAPT: Error retrieving parent for item: No resource found that matches the given name 'Base.V7.Widget.AppCompat.EditText'.
    
D:\Projekte\Unity3D\Chromecast-Draw-Game\Temp\gradleOut\appcompat\build\intermediates\bundles\default\res\values\values.xml:341: AAPT: Error retrieving parent for item: No resource found that matches the given name 'Base.DialogWindowTitle.AppCompat'.
    
D:\Projekte\Unity3D\Chromecast-Draw-Game\Temp\gradleOut\appcompat\build\intermediates\bundles\default\res\values-v17\values-v17.xml:3: AAPT: Error retrieving parent for item: No resource found that matches the given name 'Base.DialogWindowTitle.AppCompat'.
    
D:\Projekte\Unity3D\Chromecast-Draw-Game\Temp\gradleOut\appcompat\build\intermediates\bundles\default\res\values-v21\values-v21.xml:59: AAPT: Error retrieving parent for item: No resource found that matches the given name 'Base.V7.Theme.AppCompat'.
    
D:\Projekte\Unity3D\Chromecast-Draw-Game\Temp\gradleOut\appcompat\build\intermediates\bundles\default\res\values-v21\values-v21.xml:89:21-46: AAPT: No resource found that matches the given name: attr 'autoCompleteTextViewStyle'.
    
D:\Projekte\Unity3D\Chromecast-Draw-Game\Temp\gradleOut\appcompat\build\intermediates\bundles\default\res\values-v21\values-v21.xml:81:21-42: AAPT: No resource found that matches the given name: attr 'borderlessButtonStyle'.
    
D:\Projekte\Unity3D\Chromecast-Draw-Game\Temp\gradleOut\appcompat\build\intermediates\bundles\default\res\values-v21\values-v21.xml:90:21-32: AAPT: No resource found that matches the given name: attr 'buttonStyle'.
    
D:\Projekte\Unity3D\Chromecast-Draw-Game\Temp\gradleOut\appcompat\build\intermediates\bundles\default\res\values-v21\values-v21.xml:91:21-37: AAPT: No resource found that matches the given name: attr 'buttonStyleSmall'.
    
D:\Projekte\Unity3D\Chromecast-Draw-Game\Temp\gradleOut\appcompat\build\intermediates\bundles\default\res\values-v21\values-v21.xml:92:21-34: AAPT: No resource found that matches the given name: attr 'checkboxStyle'.
    
D:\Projekte\Unity3D\Chromecast-Draw-Game\Temp\gradleOut\appcompat\build\intermediates\bundles\default\res\values-v21\values-v21.xml:93:21-41: AAPT: No resource found that matches the given name: attr 'checkedTextViewStyle'.
    
D:\Projekte\Unity3D\Chromecast-Draw-Game\Temp\gradleOut\appcompat\build\intermediates\bundles\default\res\values-v21\values-v21.xml:84:21-39: AAPT: No resource found that matches the given name: attr 'editTextBackground'.
    
D:\Projekte\Unity3D\Chromecast-Draw-Game\Temp\gradleOut\appcompat\build\intermediates\bundles\default\res\values-v21\values-v21.xml:85:21-34: AAPT: No resource found that matches the given name: attr 'editTextColor'.
    
D:\Projekte\Unity3D\Chromecast-Draw-Game\Temp\gradleOut\appcompat\build\intermediates\bundles\default\res\values-v21\values-v21.xml:94:21-34: AAPT: No resource found that matches the given name: attr 'editTextStyle'.
    
D:\Projekte\Unity3D\Chromecast-Draw-Game\Temp\gradleOut\appcompat\build\intermediates\bundles\default\res\values-v21\values-v21.xml:95:21-37: AAPT: No resource found that matches the given name: attr 'radioButtonStyle'.
    
D:\Projekte\Unity3D\Chromecast-Draw-Game\Temp\gradleOut\appcompat\build\intermediates\bundles\default\res\values-v21\values-v21.xml:96:21-35: AAPT: No resource found that matches the given name: attr 'ratingBarStyle'.
    
D:\Projekte\Unity3D\Chromecast-Draw-Game\Temp\gradleOut\appcompat\build\intermediates\bundles\default\res\values-v21\values-v21.xml:80:21-55: AAPT: No resource found that matches the given name: attr 'selectableItemBackgroundBorderless'.
    
D:\Projekte\Unity3D\Chromecast-Draw-Game\Temp\gradleOut\appcompat\build\intermediates\bundles\default\res\values-v21\values-v21.xml:108: AAPT: Error retrieving parent for item: No resource found that matches the given name 'Base.V11.Theme.AppCompat.Dialog'.
    
D:\Projekte\Unity3D\Chromecast-Draw-Game\Temp\gradleOut\appcompat\build\intermediates\bundles\default\res\values-v21\values-v21.xml:111: AAPT: Error retrieving parent for item: No resource found that matches the given name 'Base.V7.Theme.AppCompat.Light'.
    
D:\Projekte\Unity3D\Chromecast-Draw-Game\Temp\gradleOut\appcompat\build\intermediates\bundles\default\res\values-v21\values-v21.xml:141:21-46: AAPT: No resource found that matches the given name: attr 'autoCompleteTextViewStyle'.
    
D:\Projekte\Unity3D\Chromecast-Draw-Game\Temp\gradleOut\appcompat\build\intermediates\bundles\default\res\values-v21\values-v21.xml:133:21-42: AAPT: No resource found that matches the given name: attr 'borderlessButtonStyle'.
    
D:\Projekte\Unity3D\Chromecast-Draw-Game\Temp\gradleOut\appcompat\build\intermediates\bundles\default\res\values-v21\values-v21.xml:142:21-32: AAPT: No resource found that matches the given name: attr 'buttonStyle'.
    
D:\Projekte\Unity3D\Chromecast-Draw-Game\Temp\gradleOut\appcompat\build\intermediates\bundles\default\res\values-v21\values-v21.xml:143:21-37: AAPT: No resource found that matches the given name: attr 'buttonStyleSmall'.
    
D:\Projekte\Unity3D\Chromecast-Draw-Game\Temp\gradleOut\appcompat\build\intermediates\bundles\default\res\values-v21\values-v21.xml:144:21-34: AAPT: No resource found that matches the given name: attr 'checkboxStyle'.
    
D:\Projekte\Unity3D\Chromecast-Draw-Game\Temp\gradleOut\appcompat\build\intermediates\bundles\default\res\values-v21\values-v21.xml:145:21-41: AAPT: No resource found that matches the given name: attr 'checkedTextViewStyle'.
    
D:\Projekte\Unity3D\Chromecast-Draw-Game\Temp\gradleOut\appcompat\build\intermediates\bundles\default\res\values-v21\values-v21.xml:136:21-39: AAPT: No resource found that matches the given name: attr 'editTextBackground'.
    
D:\Projekte\Unity3D\Chromecast-Draw-Game\Temp\gradleOut\appcompat\build\intermediates\bundles\default\res\values-v21\values-v21.xml:137:21-34: AAPT: No resource found that matches the given name: attr 'editTextColor'.
    
D:\Projekte\Unity3D\Chromecast-Draw-Game\Temp\gradleOut\appcompat\build\intermediates\bundles\default\res\values-v21\values-v21.xml:146:21-34: AAPT: No resource found that matches the given name: attr 'editTextStyle'.
    
D:\Projekte\Unity3D\Chromecast-Draw-Game\Temp\gradleOut\appcompat\build\intermediates\bundles\default\res\values-v21\values-v21.xml:147:21-37: AAPT: No resource found that matches the given name: attr 'radioButtonStyle'.
    
D:\Projekte\Unity3D\Chromecast-Draw-Game\Temp\gradleOut\appcompat\build\intermediates\bundles\default\res\values-v21\values-v21.xml:148:21-35: AAPT: No resource found that matches the given name: attr 'ratingBarStyle'.
    
D:\Projekte\Unity3D\Chromecast-Draw-Game\Temp\gradleOut\appcompat\build\intermediates\bundles\default\res\values-v21\values-v21.xml:132:21-55: AAPT: No resource found that matches the given name: attr 'selectableItemBackgroundBorderless'.
    
D:\Projekte\Unity3D\Chromecast-Draw-Game\Temp\gradleOut\appcompat\build\intermediates\bundles\default\res\values-v21\values-v21.xml:160: AAPT: Error retrieving parent for item: No resource found that matches the given name 'Base.V11.Theme.AppCompat.Light.Dialog'.
    
D:\Projekte\Unity3D\Chromecast-Draw-Game\Temp\gradleOut\appcompat\build\intermediates\bundles\default\res\values-hdpi-v4\values-hdpi-v4.xml:3: error: Error retrieving parent for item: No resource found that matches the given name 'Base.Widget.AppCompat.DrawerArrowToggle.Common'.

D:\Projekte\Unity3D\Chromecast-Draw-Game\Temp\gradleOut\appcompat\build\intermediates\bundles\default\res\values-hdpi-v4\values-hdpi-v4.xml:4: error: Error: No resource found that matches the given name: attr 'barSize'.

D:\Projekte\Unity3D\Chromecast-Draw-Game\Temp\gradleOut\appcompat\build\intermediates\bundles\default\res\values-hdpi-v4\values-hdpi-v4.xml:6: error: Error: No resource found that matches the given name: attr 'drawableSize'.

D:\Projekte\Unity3D\Chromecast-Draw-Game\Temp\gradleOut\appcompat\build\intermediates\bundles\default\res\values-hdpi-v4\values-hdpi-v4.xml:5: error: Error: No resource found that matches the given name: attr 'gapBetweenBars'.

D:\Projekte\Unity3D\Chromecast-Draw-Game\Temp\gradleOut\appcompat\build\intermediates\bundles\default\res\values-v12\values-v12.xml:3: error: Error retrieving parent for item: No resource found that matches the given name 'Base.V7.Widget.AppCompat.AutoCompleteTextView'.

D:\Projekte\Unity3D\Chromecast-Draw-Game\Temp\gradleOut\appcompat\build\intermediates\bundles\default\res\values-v12\values-v12.xml:6: error: Error retrieving parent for item: No resource found that matches the given name 'Base.V7.Widget.AppCompat.EditText'.

D:\Projekte\Unity3D\Chromecast-Draw-Game\Temp\gradleOut\appcompat\build\intermediates\bundles\default\res\values\values.xml:341: error: Error retrieving parent for item: No resource found that matches the given name 'Base.DialogWindowTitle.AppCompat'.

D:\Projekte\Unity3D\Chromecast-Draw-Game\Temp\gradleOut\appcompat\build\intermediates\bundles\default\res\values-v17\values-v17.xml:3: error: Error retrieving parent for item: No resource found that matches the given name 'Base.DialogWindowTitle.AppCompat'.

D:\Projekte\Unity3D\Chromecast-Draw-Game\Temp\gradleOut\appcompat\build\intermediates\bundles\default\res\values-v21\values-v21.xml:59: error: Error retrieving parent for item: No resource found that matches the given name 'Base.V7.Theme.AppCompat'.

D:\Projekte\Unity3D\Chromecast-Draw-Game\Temp\gradleOut\appcompat\build\intermediates\bundles\default\res\values-v21\values-v21.xml:89: error: Error: No resource found that matches the given name: attr 'autoCompleteTextViewStyle'.

D:\Projekte\Unity3D\Chromecast-Draw-Game\Temp\gradleOut\appcompat\build\intermediates\bundles\default\res\values-v21\values-v21.xml:81: error: Error: No resource found that matches the given name: attr 'borderlessButtonStyle'.

D:\Projekte\Unity3D\Chromecast-Draw-Game\Temp\gradleOut\appcompat\build\intermediates\bundles\default\res\values-v21\values-v21.xml:90: error: Error: No resource found that matches the given name: attr 'buttonStyle'.

D:\Projekte\Unity3D\Chromecast-Draw-Game\Temp\gradleOut\appcompat\build\intermediates\bundles\default\res\values-v21\values-v21.xml:91: error: Error: No resource found that matches the given name: attr 'buttonStyleSmall'.

D:\Projekte\Unity3D\Chromecast-Draw-Game\Temp\gradleOut\appcompat\build\intermediates\bundles\default\res\values-v21\values-v21.xml:92: error: Error: No resource found that matches the given name: attr 'checkboxStyle'.

D:\Projekte\Unity3D\Chromecast-Draw-Game\Temp\gradleOut\appcompat\build\intermediates\bundles\default\res\values-v21\values-v21.xml:93: error: Error: No resource found that matches the given name: attr 'checkedTextViewStyle'.

D:\Projekte\Unity3D\Chromecast-Draw-Game\Temp\gradleOut\appcompat\build\intermediates\bundles\default\res\values-v21\values-v21.xml:84: error: Error: No resource found that matches the given name: attr 'editTextBackground'.

D:\Projekte\Unity3D\Chromecast-Draw-Game\Temp\gradleOut\appcompat\build\intermediates\bundles\default\res\values-v21\values-v21.xml:85: error: Error: No resource found that matches the given name: attr 'editTextColor'.

D:\Projekte\Unity3D\Chromecast-Draw-Game\Temp\gradleOut\appcompat\build\intermediates\bundles\default\res\values-v21\values-v21.xml:94: error: Error: No resource found that matches the given name: attr 'editTextStyle'.

D:\Projekte\Unity3D\Chromecast-Draw-Game\Temp\gradleOut\appcompat\build\intermediates\bundles\default\res\values-v21\values-v21.xml:95: error: Error: No resource found that matches the given name: attr 'radioButtonStyle'.

D:\Projekte\Unity3D\Chromecast-Draw-Game\Temp\gradleOut\appcompat\build\intermediates\bundles\default\res\values-v21\values-v21.xml:96: error: Error: No resource found that matches the given name: attr 'ratingBarStyle'.

D:\Projekte\Unity3D\Chromecast-Draw-Game\Temp\gradleOut\appcompat\build\intermediates\bundles\default\res\values-v21\values-v21.xml:80: error: Error: No resource found that matches the given name: attr 'selectableItemBackgroundBorderless'.

D:\Projekte\Unity3D\Chromecast-Draw-Game\Temp\gradleOut\appcompat\build\intermediates\bundles\default\res\values-v21\values-v21.xml:108: error: Error retrieving parent for item: No resource found that matches the given name 'Base.V11.Theme.AppCompat.Dialog'.

D:\Projekte\Unity3D\Chromecast-Draw-Game\Temp\gradleOut\appcompat\build\intermediates\bundles\default\res\values-v21\values-v21.xml:111: error: Error retrieving parent for item: No resource found that matches the given name 'Base.V7.Theme.AppCompat.Light'.

D:\Projekte\Unity3D\Chromecast-Draw-Game\Temp\gradleOut\appcompat\build\intermediates\bundles\default\res\values-v21\values-v21.xml:141: error: Error: No resource found that matches the given name: attr 'autoCompleteTextViewStyle'.

D:\Projekte\Unity3D\Chromecast-Draw-Game\Temp\gradleOut\appcompat\build\intermediates\bundles\default\res\values-v21\values-v21.xml:133: error: Error: No resource found that matches the given name: attr 'borderlessButtonStyle'.

D:\Projekte\Unity3D\Chromecast-Draw-Game\Temp\gradleOut\appcompat\build\intermediates\bundles\default\res\values-v21\values-v21.xml:142: error: Error: No resource found that matches the given name: attr 'buttonStyle'.

D:\Projekte\Unity3D\Chromecast-Draw-Game\Temp\gradleOut\appcompat\build\intermediates\bundles\default\res\values-v21\values-v21.xml:143: error: Error: No resource found that matches the given name: attr 'buttonStyleSmall'.

D:\Projekte\Unity3D\Chromecast-Draw-Game\Temp\gradleOut\appcompat\build\intermediates\bundles\default\res\values-v21\values-v21.xml:144: error: Error: No resource found that matches the given name: attr 'checkboxStyle'.

D:\Projekte\Unity3D\Chromecast-Draw-Game\Temp\gradleOut\appcompat\build\intermediates\bundles\default\res\values-v21\values-v21.xml:145: error: Error: No resource found that matches the given name: attr 'checkedTextViewStyle'.

D:\Projekte\Unity3D\Chromecast-Draw-Game\Temp\gradleOut\appcompat\build\intermediates\bundles\default\res\values-v21\values-v21.xml:136: error: Error: No resource found that matches the given name: attr 'editTextBackground'.

D:\Projekte\Unity3D\Chromecast-Draw-Game\Temp\gradleOut\appcompat\build\intermediates\bundles\default\res\values-v21\values-v21.xml:137: error: Error: No resource found that matches the given name: attr 'editTextColor'.

D:\Projekte\Unity3D\Chromecast-Draw-Game\Temp\gradleOut\appcompat\build\intermediates\bundles\default\res\values-v21\values-v21.xml:146: error: Error: No resource found that matches the given name: attr<message truncated>